1909 Shanghai Conference
type: Concept
broader: drug policy conventions
definition: The 1909 Shanghai Conference was the first international conference to address the issue of drugs. Although the resolutions adopted at the conference were nonbinding, it resulted in the Hague Opium Conferences (1912–14) and the adoption of the 1912 International Opium Convention, which, combined with later treaties, restricted opium production and international trade. [Source: Encyclopedia of Drug Policy; 1909 Shanghai Conference]

events
type: Collection
type: ConceptGroup
member: 1909 Shanghai Conference

drug policy conventions
type: Concept
narrower: 1909 Shanghai Conference