Abbie Hoffman
type: Concept
broader: political and social movements (North America)
definition: Abbott “Abbie” Hoffman was a cultural revolutionary of the 1960s who used street theater, satire, and media sound bites to ignite American dissent. Hoffman, along with other New Left leaders, oriented the Hippie youth counterculture toward the anti–Vietnam War movement. [Source: Encyclopedia of Activism and Social Justice; Hoffman, Abbie (1936–1989)]

people
type: Collection
type: ConceptGroup
member: Abbie Hoffman

political and social movements (North America)
type: Concept
narrower: Abbie Hoffman