Abdullah Ocalan
type: Concept
broader: people associated with terrorism
definition: Abdullah Ocalan, the leader of the left-wing guerrilla unit known as the Kurdistan Workers’ Party (PKK), was born in 1948 in southeastern Turkey, near the Syrian border. He is generally considered to be the strongest advocate and fighter for Kurdish sovereignty and has been labeled a hero by some Kurds, a terrorist by most international intelligence sources, and a “baby killer” by the Turkish government. [Source: The SAGE Encyclopedia of Terrorism; Ocalan, Abdullah (1948–)]

people
type: Collection
type: ConceptGroup
member: Abdullah Ocalan

people associated with terrorism
type: Concept
narrower: Abdullah Ocalan