Alaska Climate Research Center
type: Concept
broader: institutions studying climate change
definition: The Alaska Climate Research Center is a research and service organization at the Geophysical Institute at the University of Alaska Fairbanks, and conducts research focusing on the climate of Alaska and other polar regions. It also houses an archive of Alaska climate data. [Source: Encyclopedia of Global Warming & Climate Change; Alaska Climate Research Center]

organizations
type: Collection
type: ConceptGroup
member: Alaska Climate Research Center

institutions studying climate change
type: Concept
narrower: Alaska Climate Research Center