Antigua And Barbuda
type: Concept
broader: West Indies
definition: Antigua and Barbuda is a federation of two islands in the Caribbean. It is located southeast of Puerto Rico, with an area of 443 square kilometers (Antigua 280; Barbuda 161) and a population of 67,897 people (July 2003 estimate). [Source: Encyclopedia of Law Enforcement; Antigua and Barbuda]

West Indies
type: Concept
narrower: Antigua And Barbuda

concepts
type: Collection
type: ConceptGroup
member: Antigua And Barbuda