Bahrain
type: Concept
broader: Middle East
definition: Bahrain is one of the most densely populated countries in the world; about 89 percent of the population lives in the two principal cities of Manama and Al Muharraq. Approximately 66 percent of the indigenous population is originally from the Arabian Peninsula and Iran. [Source: Encyclopedia of Motherhood; Bahrain]

Middle East
type: Concept
narrower: Bahrain

concepts
type: Collection
type: ConceptGroup
member: Bahrain