Berlin crises
type: Concept
broader: planning, strategy, and command and control
definition: The former Nazi capital, Berlin, was both literally and metaphorically, at the center in the postwar conflict between the East and the West. The city, occupied by rival powers, repeatedly emerged as a site of high tensions that threatened to convert the Cold War into a “hot” shooting war between the United States and the Soviet Union. [Source: Encyclopedia of U.S. Political History; Berlin Crises]

concepts
type: Collection
type: ConceptGroup
member: Berlin crises

planning, strategy, and command and control
type: Concept
narrower: Berlin crises