C. David Naylor
type: Concept
broader: key people in health services research
definition: C. David Naylor is the president of the University of Toronto. He is an internationally recognized leader in the fields of health services research, evidence-based medicine, and health policy. [Source: Encyclopedia of Health Services Research; Naylor, C. David]

people
type: Collection
type: ConceptGroup
member: C. David Naylor

key people in health services research
type: Concept
narrower: C. David Naylor