California Institute of Technology
type: Concept
broader: institutions studying climate change
definition: THE CALIFORNIA INSTITUTE of Technology, also known as CalTech, or simply Tech, is a private university and research institute located in Pasadena, California. Established in 1891, it offers graduate and undergraduate instruction, and research, in pure and applied science and engineering. [Source: Encyclopedia of Global Warming and Climate Change; California Institute of Technology]

organizations
type: Collection
type: ConceptGroup
member: California Institute of Technology

institutions studying climate change
type: Concept
narrower: California Institute of Technology