Charles Albright
type: Concept
broader: serial murder
definition: Charles Albright was a serial killer in Texas between 1990 and 1991. He murdered several female prostitutes, engaging in paraphilic sexual behavior or autoerotic asphyxia, and in ritualistic trophy taking, surgically removing the eyeballs of his victims. [Source: Encyclopedia of Murder and Violent Crime; Charles Albright]

people
type: Collection
type: ConceptGroup
member: Charles Albright

serial murder
type: Concept
narrower: Charles Albright