Climate Impacts Link project
type: Concept
broader: institutions studying climate change
definition: The Climate Impacts LINK Project was established by the United Kingdom's (UK) Department of the Environment, Food, and Rural Affairs (DEFRA) in 1991 to provide climate model data for use by institutions, researchers, political organizations, and the private sector, whether domestic or foreign. Data from LINK is used in numerous fields, including aviation, engineering, public policy, economics, and the physical sciences. [Source: Encyclopedia of Global Warming & Climate Change; Climate Impacts LINK Project]

concepts
type: Collection
type: ConceptGroup
member: Climate Impacts Link project

institutions studying climate change
type: Concept
narrower: Climate Impacts Link project