D.C. sniper
type: Concept
broader: violence and crime
definition: On October 2, 2002, at approximately 5:20 p.m., the window of a Michaels craft store in Aspen Hill, Maryland, was shattered by a single bullet. This bullet continued through the store, barely missing the cashier on duty and embedding into a rear wall of the store. [Source: Encyclopedia of Race and Crime; D.C. Sniper]

concepts
type: Collection
type: ConceptGroup
member: D.C. sniper

violence and crime
type: Concept
narrower: D.C. sniper