Dallin Harris Oaks
type: Concept
broader: key people in the Fourth Amendment
definition: Dallin Harris Oaks (1932–) wrote one of the most comprehensive essays about the pros and cons of implementing the exclusionary rule in the protection of Fourth Amendment rights. The Supreme Court applied this rule to exclude illegally obtained evidence at the federal level in Weeks v. United States (1914) and at the state level in Mapp v. Ohio (1961). [Source: Encyclopedia of the Fourth Amendment; Oaks, Dallin Harris]

people
type: Collection
type: ConceptGroup
member: Dallin Harris Oaks

key people in the Fourth Amendment
type: Concept
narrower: Dallin Harris Oaks