Dannie Abse
type: Concept
broader: key people in global health
definition: Dannie Abse, a Welsh writer and pulmonologist, is considered one of Britain's most important contemporary poets. Abse's poems, plays, essays, and novels have met both critical and popular success due to his ability to signify universal themes through frank depictions of daily life. [Source: Encyclopedia of Global Health; Abse, Dannie (1923–)]

people
type: Collection
type: ConceptGroup
member: Dannie Abse

key people in global health
type: Concept
narrower: Dannie Abse