Deming model
type: Concept
alternative label: Deming cycle
broader: manufacturing and operations
definition: A method for ensuring that quality is incorporated into every stage of every task carried out by an organization is known as the Deming Model or Deming Cycle. The model is named for Dr. [Source: Encyclopedia of Business in Today's World; Deming Model]

concepts
type: Collection
type: ConceptGroup
member: Deming model

manufacturing and operations
type: Concept
narrower: Deming model