Dennis Hart Mahan
type: Concept
broader: war and gender
definition: U.S. Military Academy Professor Dennis Hart Mahan was the most influential American military thinker of the first half of the 19th century. [Source: Encyclopedia of War & American Society; Mahan, Dennis Hart]

people
type: Collection
type: ConceptGroup
member: Dennis Hart Mahan

war and gender
type: Concept
narrower: Dennis Hart Mahan