E. Mavis Hetherington
type: Concept
broader: key people in human development
definition: Eileen Mavis Hetherington is Professor of Psychology, Emeritus, at the University of Virginia. Her distinguished career of more than 50 years is highlighted by contributions to research on childhood psychopathology, personality and social development, and stress and coping, but she is perhaps best known for her work on the effects of divorce and remarriage on child development. [Source: Encyclopedia of Human Development; Hetherington, E. Mavis (1926–)]

people
type: Collection
type: ConceptGroup
member: E. Mavis Hetherington

key people in human development
type: Concept
narrower: E. Mavis Hetherington