Elmira system
type: Concept
broader: parole
definition: Elmira refers to two distinct prison experiences in the American narrative. The first and less well-known episode involves the Elmira (New York) facility's function as a prison camp for Confederate prisoners of war. [Source: Encyclopedia of Community Corrections; Elmira System]

concepts
type: Collection
type: ConceptGroup
member: Elmira system

parole
type: Concept
narrower: Elmira system