Erik Erikson
type: Concept
broader: key people in human development
definition: Erik Erikson was born near Frankfurt, Germany, and went on to make several important contributions to the field of life span development. After graduating from high school, Erikson traveled around Europe and studied art in Germany. [Source: Encyclopedia of Human Development; Erikson, Erik (1902–1994)]

people
type: Collection
type: ConceptGroup
member: Erik Erikson

key people in human development
type: Concept
narrower: Erik Erikson