G7
type: Concept
broader: international organization (political science)
definition: Group of 7 (G7) is an assemblage of leading industrialized states. These states convene annually to discuss world economic problems. [Source: Encyclopedia of Governance; Group of 7]

concepts
type: Collection
type: ConceptGroup
member: G7

international organization (political science)
type: Concept
narrower: G7