G8/G20
type: Concept
broader: institutions studying climate change
definition: The G8 is the shortened name of the Group of Eight. The G8 is composed of the eight largest industrial economies in the world—Japan, Canada, the United States, Great Britain, France, Germany, Italy, and Russia. [Source: Encyclopedia of Global Warming & Climate Change; G8/G20]

concepts
type: Collection
type: ConceptGroup
member: G8/G20

institutions studying climate change
type: Concept
narrower: G8/G20