GIS implementation
type: Concept
broader: geographic information systems
definition: A geographic information system (GIS) should be considered as an information system rather than as a software product when planning GIS implementation in an organization. Different organizations that implement identical GIS software could experience very different outcomes with respect to their success. [Source: Encyclopedia of Geography; GIS Implementation]

concepts
type: Collection
type: ConceptGroup
member: GIS implementation

geographic information systems
type: Concept
narrower: GIS implementation