Gadi Wolfsfeld
type: Concept
broader: key people in political communication
definition: Gadi Wolfsfeld is best known for his research on the role of the media in political conflicts and peace processes. As an Israeli political science and communication scholar at the Hebrew University of Jerusalem, his main political laboratory is the Israeli–Palestinian conflict. [Source: Encyclopedia of Political Communication; Wolfsfeld, Gadi (1951–)]

people
type: Collection
type: ConceptGroup
member: Gadi Wolfsfeld

key people in political communication
type: Concept
narrower: Gadi Wolfsfeld