Garbage Project
type: Concept
broader: industrial/commercial consumption and waste
definition: The Garbage Project was founded in 1973 by William Rathje and a group of students at the University of Arizona. Since its inception, it has produced numerous studies supported by a variety of government agencies, nonprofit institutions, and private companies. [Source: Encyclopedia of Consumption and Waste: The Social Science of Garbage; Garbage Project]

concepts
type: Collection
type: ConceptGroup
member: Garbage Project

industrial/commercial consumption and waste
type: Concept
narrower: Garbage Project