Gary Hart
type: Concept
broader: key people in political communication
definition: Gary W. Hart is a former two-term senator from Colorado and was a candidate for the Democratic nomination for president in 1984 and 1988. Although he was the frontrunner going into the 1988 Democratic primaries, he may be best remembered for an act of hubris. [Source: Encyclopedia of Political Communication; Hart, Gary (1936—)]

people
type: Collection
type: ConceptGroup
member: Gary Hart

key people in political communication
type: Concept
narrower: Gary Hart