Go (board game)
type: Concept
broader: board games
definition: Go is a board game for two players, played with black and white game pieces on a 19 × 19 grid. The game originated in China, and gained popularity in Korea and Japan in the 1st millennium ce. [Source: Encyclopedia of Play in Today's Society; Go]

board games
type: Concept
narrower: Go (board game)

concepts
type: Collection
type: ConceptGroup
member: Go (board game)