Halbert Robinson Center
type: Concept
broader: organizations (gifted and talented education)
definition: The Halbert and Nancy Robinson Center for Young Scholars (Robinson Center) at the University of Washington (UW) is a pioneer in the practice of early university entrance and a regional, national, and international leader in working with gifted students and their families. The Robinson Center began in 1977 as the Child Development Research Group and admitted the first two early entrance students to the UW at that time. [Source: Encyclopedia of Giftedness, Creativity, and Talent; Halbert Robinson Center]

organizations
type: Collection
type: ConceptGroup
member: Halbert Robinson Center

organizations (gifted and talented education)
type: Concept
narrower: Halbert Robinson Center