Harold Foote Gosnell
type: Concept
broader: key people in political science
definition: Harold Foote Gosnell (1896–1997) was an American political scientist and social science methodologist. He is remembered for bringing quantitative methodology into the mainstream of political science, using both experimental and statistical methods. [Source: The Encyclopedia of Political Science; Gosnell, Harold Foote]

people
type: Collection
type: ConceptGroup
member: Harold Foote Gosnell

key people in political science
type: Concept
narrower: Harold Foote Gosnell