Harold Joseph Laski
type: Concept
broader: key people in political science
definition: Harold Laski (1893–1950) was a twentieth-century British political theorist and the author of more than twenty books and thousands of articles. He was also a celebrated teacher at the London School of Economics and Politics, a prominent leader in the Labour Party, and a widely read public intellectual in both Britain and America. [Source: The Encyclopedia of Political Science; Laski, Harold Joseph]

people
type: Collection
type: ConceptGroup
member: Harold Joseph Laski

key people in political science
type: Concept
narrower: Harold Joseph Laski