IDRISI
type: Concept
broader: organizational and institutional aspects
definition: IDRISI is a geographic information system (GIS) with a strong focus on data analysis and image processing tools. It was developed at Clark University under the direction of Ron Eastman, beginning in 1987, and is now supported by Clark Labs, a nonprofit research and development laboratory within the Graduate School of Geography. [Source: Encyclopedia of Geographic Information Science; IDRISI]

methods
type: Collection
type: ConceptGroup
member: IDRISI

organizational and institutional aspects
type: Concept
narrower: IDRISI