Institute of British Geographers
type: Concept
broader: organizations (geography)
definition: For some 60 years, the Institute of British Geographers (IBG) has been the United Kingdom's leading learned society for geographers. It was founded in 1933 and merged with the Royal Geographical Society in 1995. [Source: Encyclopedia of Geography; Institute of British Geographers]

organizations
type: Collection
type: ConceptGroup
member: Institute of British Geographers

organizations (geography)
type: Concept
narrower: Institute of British Geographers