Islamic city
type: Concept
broader: cities: historical overviews
definition: The term madinah by and large refers to the primordial Islamic city—the city of the Prophet Muhammad, established circa AD 622 to 632. Abu Nasr al-Fara-bi's (ca. [Source: Encyclopedia of Urban Studies; Islamic City]

cities: historical overviews
type: Concept
narrower: Islamic city

concepts
type: Collection
type: ConceptGroup
member: Islamic city