Jacobo Arbenz
type: Concept
broader: political and social movements (Latin America and Caribbean)
definition: Jacobo Arbenz Guzmán, who was elected president of Guatemala in 1951 and overthrown by a U.S.-organized coup in 1954, was born in Quetzaltenango, Guatemala, on September 14, 1913. He attended the national military academy, where he also taught for a number of years, during which time he married Maria Cristina Vilanova, daughter of a Salvadorean landowner, whose socialist ideas and associations deeply influenced his own views and subsequent policies. [Source: Encyclopedia of Activism and Social Justice; Arbenz, Jacobo (1913–1971)]

people
type: Collection
type: ConceptGroup
member: Jacobo Arbenz

political and social movements (Latin America and Caribbean)
type: Concept
narrower: Jacobo Arbenz