Jaime de Angulo
type: Concept
broader: key people in anthropology
definition: Jaime de Angulo (1887–1950), the eccentric amateur anthropologist, helped to move the field of anthropology away from armchair theorizing with decades of intense linguistic fieldwork among, most notably, the Achumawi or Pit River Indians of Northern California. De Angulo collected and studied a wide range of severely endangered languages from the American West and Mexico during the 1920s and 1930s, a period of time during which formally trained, and funded, anthropologists were scarce. [Source: Encyclopedia of Anthropology; De Angulo, Jaime (1887–1950)]

people
type: Collection
type: ConceptGroup
member: Jaime de Angulo

key people in anthropology
type: Concept
narrower: Jaime de Angulo