Jainist ethics
type: Concept
broader: applied business ethics
definition: Jainism is an ancient religion that originated in India. The Jains, primarily concentrated in India, numbered approximately 3.2 million in the latest census, but Jains also live in other parts of Asia, East Africa, Europe, and North America. [Source: Encyclopedia of Business Ethics and Society; Jainist Ethics]

applied business ethics
type: Concept
narrower: Jainist ethics

concepts
type: Collection
type: ConceptGroup
member: Jainist ethics