James Burnham
type: Concept
broader: key people in political science
definition: American political theorist James Burnham (1905–1987) was one of the most influential anticommunist thinkers of the cold war era. Like many anticommunists, he started out as a Trotskyite, but eventually he moved away from Trotskyism and began a slow journey to the right. [Source: The Encyclopedia of Political Science; Burnham, James]

people
type: Collection
type: ConceptGroup
member: James Burnham

key people in political science
type: Concept
narrower: James Burnham