James Cardinal Gibbons
type: Concept
broader: key people in educational reform
definition: As the archbishop of Baltimore, James Cardinal Gibbons was the nominal leader of the Catholic Church in the United States from 1877 to 1921. In this capacity, he was a bridge between Roman Catholicism and American Catholic values. [Source: Encyclopedia of Educational Reform and Dissent; Gibbons, James Cardinal (1834–1921)]

people
type: Collection
type: ConceptGroup
member: James Cardinal Gibbons

key people in educational reform
type: Concept
narrower: James Cardinal Gibbons