James Garfield
type: Concept
broader: key people in the social history of crime
definition: James Garfield was born and raised in Ohio—the state that he would eventually be seated in the U.S. House of Representatives to represent. [Source: The SAGE Encyclopedia of World Poverty; Garfield, James (Administration)]

people
type: Collection
type: ConceptGroup
member: James Garfield

key people in the social history of crime
type: Concept
narrower: James Garfield