James Luther Adams
type: Concept
broader: key people in global religion
definition: James Luther Adams was a preeminent Unitarian Universalist theologian and ethicist of the 20th century. Born in Ritzville, Washington, he was the son of a Baptist country preacher and farmer. [Source: Encyclopedia of Global Religion; Adams, James Luther (1901–1994)]

people
type: Collection
type: ConceptGroup
member: James Luther Adams

key people in global religion
type: Concept
narrower: James Luther Adams