James V. Bennett
type: Concept
broader: staff
definition: James V. Bennett was the second director of the Federal Bureau of Prisons (BOP), serving longer than any other (1937 to 1964). Bennett played a role in establishing the centralized bureaucracy for overseeing the operation of federal prisons, the BOP, while working for the U.S. Bureau of Efficiency. [Source: Encyclopedia of Prisons & Correctional Facilities; Bennett, James V. (1894–1978)]

cases
type: Collection
type: ConceptGroup
member: James V. Bennett

staff
type: Concept
narrower: James V. Bennett