Javits program
type: Concept
broader: gifted and talented programs and interventions
definition: The Javits program is a part of the 1988 Elementary and Secondary Education Act that was reauthorized in 2001. This provides the only federal funding apportioned specifically to address the needs of gifted and talented students. [Source: Encyclopedia of Giftedness, Creativity, and Talent; Javits Program]

concepts
type: Collection
type: ConceptGroup
member: Javits program

gifted and talented programs and interventions
type: Concept
narrower: Javits program