Jean Marie Auel
type: Concept
broader: key people in anthropology
definition: Jean Marie Auel, born on February 18, 1936, in Chicago, Illinois, is the author of the series, Earth's Children, a collection of novels revolving around the interactions of Cro-Magnon people with Neandertals. Auel did not come to her chosen craft as a trained writer. [Source: Encyclopedia of Anthropology; Auel, Jean Marie (1936–)]

people
type: Collection
type: ConceptGroup
member: Jean Marie Auel

key people in anthropology
type: Concept
narrower: Jean Marie Auel