Jean Rhodes
type: Concept
broader: key people in developmental science
definition: Jean Rhodes has devoted her career to understanding the role of mentors in promoting positive developmental outcomes among children and adolescents. Her studies are among the first to yield empirical findings regarding the availability of mentors in urban populations and the ways in which mentors influence adolescent adjustment over time. [Source: Encyclopedia of Applied Developmental Science; Rhodes, Jean]

people
type: Collection
type: ConceptGroup
member: Jean Rhodes

key people in developmental science
type: Concept
narrower: Jean Rhodes