John Flavell
type: Concept
broader: key people in human development
definition: John Flavell is credited with introducing the work of Piaget to American psychology and founding the field of metacognition. Flavell is a preeminent figure in modern developmental psychology. [Source: Encyclopedia of Human Development; Flavell, John (1928–)]

people
type: Collection
type: ConceptGroup
member: John Flavell

key people in human development
type: Concept
narrower: John Flavell