Kantian ethics
type: Concept
broader: theories of ethics
definition: Immanuel Kant (1724–1804) is arguably the greatest ethical theorist philosophy has produced. However, his writings on ethics are difficult to understand, and his ethical theory has been subject to multiple interpretations and to considerable criticism. [Source: Encyclopedia of Business Ethics and Society; Kantian Ethics]

concepts
type: Collection
type: ConceptGroup
member: Kantian ethics

theories of ethics
type: Concept
narrower: Kantian ethics