Karen Davis
type: Concept
broader: key people in health services research
definition: Karen Davis is the president of the Commonwealth Fund, a large New York City–based, private foundation that promotes healthcare. Davis is a nationally recognized health economist, with an extensive background in health services research and public policy. [Source: Encyclopedia of Health Services Research; Davis, Karen]

people
type: Collection
type: ConceptGroup
member: Karen Davis

key people in health services research
type: Concept
narrower: Karen Davis