Karen Strohm Kitchener
type: Concept
broader: key people in counseling
definition: Karen Strohm Kitchener is recognized internationally for her contributions to the fields of counseling psychology and higher education. Among counseling psychologists, she is best known for her work in ethics. [Source: Encyclopedia of Counseling; Kitchener, Karen Strohm (1943-)]

people
type: Collection
type: ConceptGroup
member: Karen Strohm Kitchener

key people in counseling
type: Concept
narrower: Karen Strohm Kitchener