Karen Tandy
type: Concept
broader: key people in drug policy
definition: Karen Patrice Tandy (1953-) served as administrator of the federal Drug Enforcement Administration (DEA) from 2003 to 2007. She was the first woman to hold this position. [Source: Encyclopedia of Drug Policy; Tandy, Karen]

people
type: Collection
type: ConceptGroup
member: Karen Tandy

key people in drug policy
type: Concept
narrower: Karen Tandy