Kerr L. White
type: Concept
broader: key people in health services research
definition: Kerr L. White is arguably the founder of the discipline of health services research in the United States. Throughout his long and distinguished career as a researcher, university professor, and government and foundation administrator, he developed the conceptual framework of health services research, established and shaped government health services research programs, and funded the emerging discipline of health services research. [Source: Encyclopedia of Health Services Research; White, Kerr L.]

people
type: Collection
type: ConceptGroup
member: Kerr L. White

key people in health services research
type: Concept
narrower: Kerr L. White