LGBT issues
type: Concept
broader: diversity in education
definition: Over the past 30 years, health communication research has moved from not only studying general communication issues in a health context, but also identifying the specific health needs of different patient communities. As with trends in public health, medical, nursing, psychology, counseling, and other social science disciplines, communication researchers have realized that not all populations have the same disparities or advantages when it comes to health. [Source: Encyclopedia of Health Communication; LGBT Issues]

concepts
type: Collection
type: ConceptGroup
member: LGBT issues

diversity in education
type: Concept
narrower: LGBT issues